BDBM50140304 CHEMBL19211::N-[(1R,2R)-2-(2-Propyl-2,3-dihydro-benzooxazol-7-yl)-cyclopropylmethyl]-butyramide
SMILES CCCC1Nc2cccc([C@@H]3C[C@H]3CNC(=O)CCC)c2O1
InChI Key InChIKey=OWXPWWAWLVIWOM-JYCRYNECSA-N
Data  2 KI
  Tab Delimited (TSV)   2D SDfile   Computed 3D by Vconf -m prep SDfile
Find this compound or compounds like it in BindingDB:
Activity Spreadsheet -- Enzyme Inhibition Constant Data from BindingDB
Found 1 hit for monomerid = 50140304
TargetMelatonin receptor type 1B(Homo sapiens (Human))
Bristol-Myers Squibb Pharmaceutical Research Institute
Curated by ChEMBL
LigandPNGBDBM50140304(CHEMBL19211 | N-[(1R,2R)-2-(2-Propyl-2,3-dihydro-b...)
Affinity DataKi:  0.0400nM. Assay description: Binding of 2-[125I]-iodomelatonin to membrane preparations of NIH3T3 cells stably expressing human Melatonin receptor type 1B
In DepthDetails ArticlePubMed